51Testing软件测试论坛

 找回密码
 (注-册)加入51Testing

QQ登录

只需一步,快速开始

测试开发精英班,通向高级软件测试工程师【周活动】 找茬--心里圈的故事 !【长期招募】博为峰网校招聘兼职讲师!横扫BAT,Python全栈测试开发技能大全
【107期】:快速构建python web 全栈开发的开发思维【征稿】提交你的测试成绩单! 【专题】用尽一切办法只为让你学好用例 自学软件测试那点事
查看: 3614|回复: 3

[求助] linux下安装subversion出现的错误,请教高手

[复制链接]

该用户从未签到

发表于 2010-11-2 22:00:47 | 显示全部楼层 |阅读模式
[root@localhost subversion-1.6.13]# make install
------ making install in serf
make[1]: Entering directory `/usr/subversion/subversion-1.6.13/serf'
/usr/local/apr/build-1/libtool --silent --mode=compile gcc -g -O2 -pthread -DLINUX=2 -D_REENTRANT -D_GNU_SOURCE -D_LARGEFILE64_SOURCE -I/usr/local/openssl/include -I.  -I/usr/local/apr/include/apr-1   -I/usr/local/apr-util/include/apr-1   -c -o buckets/deflate_buckets.lo buckets/deflate_buckets.c && touch buckets/deflate_buckets.lo
buckets/deflate_buckets.c:18:18: error: zlib.h: No such file or directory
buckets/deflate_buckets.c:54: error: expected specifier-qualifier-list before ‘z_stream’
buckets/deflate_buckets.c: In function ‘serf_bucket_deflate_create’:
buckets/deflate_buckets.c:90: error: ‘deflate_context_t’ has no member named ‘stream_status’
buckets/deflate_buckets.c:93: error: ‘deflate_context_t’ has no member named ‘crc’
buckets/deflate_buckets.c:95: error: ‘deflate_context_t’ has no member named ‘zstream’
buckets/deflate_buckets.c:95: error: ‘deflate_context_t’ has no member named ‘zstream’
buckets/deflate_buckets.c:111: error: ‘deflate_context_t’ has no member named ‘stream_left’
buckets/deflate_buckets.c:111: error: ‘deflate_context_t’ has no member named ‘stream_size’
buckets/deflate_buckets.c:113: error: ‘deflate_context_t’ has no member named ‘windowSize’
buckets/deflate_buckets.c:114: error: ‘deflate_context_t’ has no member named ‘memLevel’
buckets/deflate_buckets.c:115: error: ‘deflate_context_t’ has no member named ‘bufferSize’
buckets/deflate_buckets.c: In function ‘serf_deflate_read’:
buckets/deflate_buckets.c:150: error: ‘deflate_context_t’ has no member named ‘stream_left’
buckets/deflate_buckets.c:157: error: ‘deflate_context_t’ has no member named ‘hdr_buffer’
buckets/deflate_buckets.c:157: error: ‘deflate_context_t’ has no member named ‘stream_size’
buckets/deflate_buckets.c:157: error: ‘deflate_context_t’ has no member named ‘stream_left’
buckets/deflate_buckets.c:160: error: ‘deflate_context_t’ has no member named ‘stream_left’
buckets/deflate_buckets.c:162: error: ‘deflate_context_t’ has no member named ‘stream_left’
buckets/deflate_buckets.c:175: error: ‘deflate_context_t’ has no member named ‘hdr_buffer’
buckets/deflate_buckets.c:176: error: ‘deflate_context_t’ has no member named ‘hdr_buffer’
buckets/deflate_buckets.c:179: error: ‘deflate_context_t’ has no member named ‘hdr_buffer’
buckets/deflate_buckets.c:186: error: ‘deflate_context_t’ has no member named ‘hdr_buffer’
buckets/deflate_buckets.c:187: error: ‘deflate_context_t’ has no member named ‘crc’
buckets/deflate_buckets.c:190: error: ‘deflate_context_t’ has no member named ‘hdr_buffer’
buckets/deflate_buckets.c:191: error: ‘deflate_context_t’ has no member named ‘zstream’
buckets/deflate_buckets.c:197: error: ‘deflate_context_t’ has no member named ‘zstream’
buckets/deflate_buckets.c:197: error: ‘deflate_context_t’ has no member named ‘windowSize’
buckets/deflate_buckets.c:198: error: ‘Z_OK’ undeclared (first use in this function)
buckets/deflate_buckets.c:198: error: (Each undeclared identifier is reported only once
buckets/deflate_buckets.c:198: error: for each function it appears in.)
buckets/deflate_buckets.c:201: error: ‘deflate_context_t’ has no member named ‘zstream’
buckets/deflate_buckets.c:201: error: ‘deflate_context_t’ has no member named ‘buffer’
buckets/deflate_buckets.c:202: error: ‘deflate_context_t’ has no member named ‘zstream’
buckets/deflate_buckets.c:202: error: ‘deflate_context_t’ has no member named ‘bufferSize’
buckets/deflate_buckets.c:206: error: ‘deflate_context_t’ has no member named ‘zstream’
buckets/deflate_buckets.c:220: error: ‘deflate_context_t’ has no member named ‘stream_status’
buckets/deflate_buckets.c:240: error: ‘deflate_context_t’ has no member named ‘zstream’
buckets/deflate_buckets.c:244: error: ‘deflate_context_t’ has no member named ‘stream_status’
buckets/deflate_buckets.c:244: error: ‘deflate_context_t’ has no member named ‘bufferSize’
buckets/deflate_buckets.c:249: error: ‘deflate_context_t’ has no member named ‘stream_status’
buckets/deflate_buckets.c:249: error: ‘deflate_context_t’ has no member named ‘stream_status’
buckets/deflate_buckets.c:249: error: ‘deflate_context_t’ has no member named ‘stream_status’
buckets/deflate_buckets.c:250: error: ‘deflate_context_t’ has no member named ‘stream_status’
buckets/deflate_buckets.c:253: error: ‘deflate_context_t’ has no member named ‘stream_status’
buckets/deflate_buckets.c:255: error: ‘deflate_context_t’ has no member named ‘stream_status’
buckets/deflate_buckets.c:256: error: ‘deflate_context_t’ has no member named ‘stream_status’
buckets/deflate_buckets.c:260: error: ‘deflate_context_t’ has no member named ‘zstream’
buckets/deflate_buckets.c:261: error: ‘deflate_context_t’ has no member named ‘zstream’
buckets/deflate_buckets.c:264: error: ‘deflate_context_t’ has no member named ‘zstream’
buckets/deflate_buckets.c:266: error: ‘deflate_context_t’ has no member named ‘zstream’
buckets/deflate_buckets.c:268: error: ‘deflate_context_t’ has no member named ‘zstream’
buckets/deflate_buckets.c:268: error: ‘deflate_context_t’ has no member named ‘buffer’
buckets/deflate_buckets.c:269: error: ‘deflate_context_t’ has no member named ‘bufferSize’
buckets/deflate_buckets.c:269: error: ‘deflate_context_t’ has no member named ‘zstream’
buckets/deflate_buckets.c:271: error: ‘deflate_context_t’ has no member named ‘crc’
buckets/deflate_buckets.c:271: error: ‘deflate_context_t’ has no member named ‘crc’
buckets/deflate_buckets.c:271: error: expected ‘)’ before ‘Bytef’
buckets/deflate_buckets.c:271: error: ‘deflate_context_t’ has no member named ‘buffer’
buckets/deflate_buckets.c:275: error: ‘deflate_context_t’ has no member named ‘buffer’
buckets/deflate_buckets.c:279: error: ‘deflate_context_t’ has no member named ‘zstream’
buckets/deflate_buckets.c:279: error: ‘deflate_context_t’ has no member named ‘bufferSize’
buckets/deflate_buckets.c:282: error: ‘deflate_context_t’ has no member named ‘zstream’
buckets/deflate_buckets.c:282: error: ‘Z_NO_FLUSH’ undeclared (first use in this function)
buckets/deflate_buckets.c:284: error: ‘Z_STREAM_END’ undeclared (first use in this function)
buckets/deflate_buckets.c:287: error: ‘deflate_context_t’ has no member named ‘bufferSize’
buckets/deflate_buckets.c:287: error: ‘deflate_context_t’ has no member named ‘zstream’
buckets/deflate_buckets.c:288: error: ‘deflate_context_t’ has no member named ‘crc’
buckets/deflate_buckets.c:288: error: ‘deflate_context_t’ has no member named ‘crc’
buckets/deflate_buckets.c:288: error: expected ‘)’ before ‘Bytef’
buckets/deflate_buckets.c:288: error: ‘deflate_context_t’ has no member named ‘buffer’
buckets/deflate_buckets.c:291: error: ‘deflate_context_t’ has no member named ‘buffer’
buckets/deflate_buckets.c:296: error: ‘deflate_context_t’ has no member named ‘zstream’
buckets/deflate_buckets.c:296: error: ‘deflate_context_t’ has no member named ‘bufferSize’
buckets/deflate_buckets.c:306: error: ‘deflate_context_t’ has no member named ‘zstream’
buckets/deflate_buckets.c:306: error: ‘deflate_context_t’ has no member named ‘zstream’
buckets/deflate_buckets.c:314: error: ‘deflate_context_t’ has no member named ‘stream_left’
buckets/deflate_buckets.c:314: error: ‘deflate_context_t’ has no member named ‘stream_size’
buckets/deflate_buckets.c:338: error: ‘deflate_context_t’ has no member named ‘stream_status’
make[1]: *** [buckets/deflate_buckets.lo] Error 1
make[1]: Leaving directory `/usr/subversion/subversion-1.6.13/serf'
make: *** [external-install] Error 1
最后出现了两个错误,不认识!
装了很多的包,apr,apr-util,zlib,openssl,expat……。
回复

使用道具 举报

  • TA的每日心情
    奋斗
    2019-7-2 13:20
  • 签到天数: 129 天

    连续签到: 1 天

    [LV.7]测试师长

    发表于 2010-11-2 22:23:36 | 显示全部楼层
    不清楚了,不过SVN的安装我到是有自动化的脚本
    回复 支持 反对

    使用道具 举报

    该用户从未签到

     楼主| 发表于 2010-11-3 08:52:53 | 显示全部楼层
    回复 2# msnshow


        给我传一个把  QQ:332454792  谢谢
    回复 支持 反对

    使用道具 举报

  • TA的每日心情
    奋斗
    2019-7-2 13:20
  • 签到天数: 129 天

    连续签到: 1 天

    [LV.7]测试师长

    发表于 2010-11-3 21:34:08 | 显示全部楼层
    明天给你
    回复 支持 反对

    使用道具 举报

    本版积分规则

    关闭

    站长推荐上一条 /2 下一条

    小黑屋|手机版|Archiver|51Testing软件测试网 ( 沪ICP备05003035号 关于我们

    GMT+8, 2019-10-20 19:36 , Processed in 0.074398 second(s), 28 queries .

    Powered by Discuz! X3.2

    © 2001-2019 Comsenz Inc.

    快速回复 返回顶部 返回列表